Reaction Details
TargetD-aspartate oxidase
LigandBDBM50427221
Substrate/Competitorn/a
Meas. Tech.ChEMBL_1517184 (CHEMBL3620074)
Ki 8690±n/a nM
Citation Katane, MYamada, SKawaguchi, GChinen, MMatsumura, MAndo, TDoi, INakayama, KKaneko, YMatsuda, SSaitoh, YMiyamoto, TSekine, MYamaotsu, NHirono, SHomma, H Identification of Novel D-Aspartate Oxidase Inhibitors by in Silico Screening and Their Functional and Structural Characterization in Vitro. J Med Chem58:7328-40 (2015) 
 
D-aspartate oxidase
Name:D-aspartate oxidase
Type:PROTEIN
Mol. Mass.:37556.43
Organism:Mus musculus
Description:ChEMBL_109877
Residue:341
BDBM50427221
NameBDBM50427221
Synonyms:5-Aminonicotinic Acid | CHEMBL1491941
TypeSmall organic molecule
Emp. Form.C6H6N2O2
Mol. Mass.138.124
SMILESNc1cncc(c1)C(O)=O