Reaction Details
TargetRCG38204, isoform CRA_d
LigandBDBM14673
Substrate/Competitorn/a
Meas. Tech.ChEMBL_1517183 (CHEMBL3620073)
Ki 1562000±n/a nM
Citation Katane, MYamada, SKawaguchi, GChinen, MMatsumura, MAndo, TDoi, INakayama, KKaneko, YMatsuda, SSaitoh, YMiyamoto, TSekine, MYamaotsu, NHirono, SHomma, H Identification of Novel D-Aspartate Oxidase Inhibitors by in Silico Screening and Their Functional and Structural Characterization in Vitro. J Med Chem58:7328-40 (2015) 
 
RCG38204, isoform CRA_d
Name:RCG38204, isoform CRA_d
Type:PROTEIN
Mol. Mass.:37549.70
Organism:Rattus norvegicus
Description:ChEMBL_109876
Residue:341
BDBM14673
NameBDBM14673
Synonyms:Fragment 3 propanedioic acid
TypeSmall organic molecule
Emp. Form.C3H4O4
Mol. Mass.104.0615
SMILESOC(=O)CC(O)=O