Reaction Details
TargetD-aspartate oxidase
LigandBDBM50427221
Substrate/Competitorn/a
Meas. Tech.ChEMBL_1517182 (CHEMBL3620072)
Ki 3800±n/a nM
Citation Katane, MYamada, SKawaguchi, GChinen, MMatsumura, MAndo, TDoi, INakayama, KKaneko, YMatsuda, SSaitoh, YMiyamoto, TSekine, MYamaotsu, NHirono, SHomma, H Identification of Novel D-Aspartate Oxidase Inhibitors by in Silico Screening and Their Functional and Structural Characterization in Vitro. J Med Chem58:7328-40 (2015) 
 
D-aspartate oxidase
Name:D-aspartate oxidase
Type:Oxidoreductase
Mol. Mass.:37543.06
Organism:Homo sapiens (Human)
Description:Recombinant human DDO expressed and purified from sf9 insect cells, was used in enzyme assays.
Residue:341
BDBM50427221
NameBDBM50427221
Synonyms:5-Aminonicotinic Acid | CHEMBL1491941
TypeSmall organic molecule
Emp. Form.C6H6N2O2
Mol. Mass.138.124
SMILESNc1cncc(c1)C(O)=O