Reaction Details
TargetD-amino-acid oxidase
LigandBDBM23515
Substrate/Competitorn/a
Meas. Tech.ChEMBL_1517180 (CHEMBL3620070)
IC50 1125000±n/a nM
Citation Katane, MYamada, SKawaguchi, GChinen, MMatsumura, MAndo, TDoi, INakayama, KKaneko, YMatsuda, SSaitoh, YMiyamoto, TSekine, MYamaotsu, NHirono, SHomma, H Identification of Novel D-Aspartate Oxidase Inhibitors by in Silico Screening and Their Functional and Structural Characterization in Vitro. J Med Chem58:7328-40 (2015) 
 
D-amino-acid oxidase
Name:D-amino-acid oxidase
Type:Homodimer
Mol. Mass.:39476.06
Organism:Homo sapiens (Human)
Description:P14920
Residue:347
BDBM23515
NameBDBM23515
Synonyms:CHEMBL573 Nicotinic Acid pyridine-3-carboxylic acid | wampocap
TypeSmall organic molecule
Emp. Form.C6H5NO2
Mol. Mass.123.1094
SMILESOC(=O)c1cccnc1