Reaction Details
TargetD-amino-acid oxidase
LigandBDBM50427221
Substrate/Competitorn/a
Meas. Tech.ChEMBL_1517180 (CHEMBL3620070)
IC50>2500000±n/a nM
Citation Katane, MYamada, SKawaguchi, GChinen, MMatsumura, MAndo, TDoi, INakayama, KKaneko, YMatsuda, SSaitoh, YMiyamoto, TSekine, MYamaotsu, NHirono, SHomma, H Identification of Novel D-Aspartate Oxidase Inhibitors by in Silico Screening and Their Functional and Structural Characterization in Vitro. J Med Chem58:7328-40 (2015) 
 
D-amino-acid oxidase
Name:D-amino-acid oxidase
Type:Homodimer
Mol. Mass.:39476.06
Organism:Homo sapiens (Human)
Description:P14920
Residue:347
BDBM50427221
NameBDBM50427221
Synonyms:5-Aminonicotinic Acid | CHEMBL1491941
TypeSmall organic molecule
Emp. Form.C6H6N2O2
Mol. Mass.138.124
SMILESNc1cncc(c1)C(O)=O