Reaction Details
TargetDelta-type opioid receptor
LigandBDBM50122099
Substrate/Competitorn/a
Meas. Tech.ChEMBL_1517222 (CHEMBL3620206)
Ki 0.500000±n/a nM
Citation Deekonda, SWugalter, LRankin, DLargent-Milnes, TMDavis, PWang, YBassirirad, NMLai, JKulkarni, VVanderah, TWPorreca, FHruby, VJ Design and synthesis of novel bivalent ligands (MOR and DOR) by conjugation of enkephalin analogues with 4-anilidopiperidine derivatives. Bioorg Med Chem Lett25:4683-8 (2015) 
 
Delta-type opioid receptor
Name:Delta-type opioid receptor
Type:G Protein-Coupled Receptor (GPCR)
Mol. Mass.:40382.98
Organism:Homo sapiens (Human)
Description:Competition binding assays were carried out using membrane preparations from transfected HN9.10 cells that constitutively expressed the delta opioid receptor.
Residue:372
BDBM50122099
NameBDBM50122099
Synonyms:CHEMBL3617471
TypeSmall organic molecule
Emp. Form.C53H68N8O7
Mol. Mass.929.1564
SMILESCCC(=O)N(C1CCN(Cc2cccc3[C@@H](CCCc23)NC(=O)CCNC(=O)[C@H](Cc2ccccc2)NC(=O)CNC(=O)[C@@H](C)NC(=O)[C@@H](N)Cc2c(C)cc(O)cc2C)CC1)c1ccccc1