Reaction Details
TargetAndrogen receptor
LigandBDBM50122954
Substrate/Competitorn/a
Meas. Tech.ChEMBL_1520320 (CHEMBL3626370)
IC50 45200±n/a nM
Citation Inoue, KUrushibara, KKanai, MYura, KFujii, SIshigami-Yuasa, MHashimoto, YMori, SKawachi, EMatsumura, MHirano, TKagechika, HTanatani, A Design and synthesis of 4-benzyl-1-(2H)-phthalazinone derivatives as novel androgen receptor antagonists. Eur J Med Chem102:310-9 (2015) 
 
Androgen receptor
Name:Androgen receptor
Type:Receptor
Mol. Mass.:99185.27
Organism:Homo sapiens (Human)
Description:CHO cells were stably transfected with human AR gene.
Residue:920
BDBM50122954
NameBDBM50122954
Synonyms:CHEMBL3622579
TypeSmall organic molecule
Emp. Form.C15H13N3O
Mol. Mass.251.2832
SMILESNc1ccccc1Cc1n[nH]c(=O)c2ccccc12