Reaction Details
TargetTyrosine-protein kinase SYK
LigandBDBM50123580
Substrate/Competitorn/a
Meas. Tech.ChEMBL_1521568 (CHEMBL3627446)
IC50 517±n/a nM
Citation Thoma, GVeenstra, SStrang, RBlanz, JVangrevelinghe, EBerghausen, JLee, CCZerwes, HG Orally bioavailable Syk inhibitors with activity in a rat PK/PD model. Bioorg Med Chem Lett25:4642-7 (2015) 
 
Tyrosine-protein kinase SYK
Name:Tyrosine-protein kinase SYK
Type:Enzyme
Mol. Mass.:72079.99
Organism:Homo sapiens (Human)
Description:P43405
Residue:635
BDBM50123580
NameBDBM50123580
Synonyms:CHEMBL3622208
TypeSmall organic molecule
Emp. Form.C20H21N3O4S
Mol. Mass.399.463
SMILES[H][C@@]1(CNC(=O)C1)[C@@H](C)Oc1nc(cc2ncsc12)-c1ccc(OC)c(OC)c1