Reaction Details
TargetTyrosine-protein kinase SYK
LigandBDBM50123584
Substrate/Competitorn/a
Meas. Tech.ChEMBL_1521568 (CHEMBL3627446)
IC50 538±n/a nM
Citation Thoma, GVeenstra, SStrang, RBlanz, JVangrevelinghe, EBerghausen, JLee, CCZerwes, HG Orally bioavailable Syk inhibitors with activity in a rat PK/PD model. Bioorg Med Chem Lett25:4642-7 (2015) 
 
Tyrosine-protein kinase SYK
Name:Tyrosine-protein kinase SYK
Type:Enzyme
Mol. Mass.:72079.99
Organism:Homo sapiens (Human)
Description:P43405
Residue:635
BDBM50123584
NameBDBM50123584
Synonyms:CHEMBL3622205
TypeSmall organic molecule
Emp. Form.C16H17N5O2S
Mol. Mass.343.403
SMILES[H][C@@]1(CNC(=O)C1)[C@@H](C)Oc1nc(cc2ncsc12)-c1cnn(C)c1