Reaction Details
TargetTyrosine-protein kinase SYK
LigandBDBM50123570
Substrate/Competitorn/a
Meas. Tech.ChEMBL_1521567 (CHEMBL3627445)
IC50 107±n/a nM
Citation Thoma, GVeenstra, SStrang, RBlanz, JVangrevelinghe, EBerghausen, JLee, CCZerwes, HG Orally bioavailable Syk inhibitors with activity in a rat PK/PD model. Bioorg Med Chem Lett25:4642-7 (2015) 
 
Tyrosine-protein kinase SYK
Name:Tyrosine-protein kinase SYK
Type:Enzyme
Mol. Mass.:72079.99
Organism:Homo sapiens (Human)
Description:P43405
Residue:635
BDBM50123570
NameBDBM50123570
Synonyms:CHEMBL3622698
TypeSmall organic molecule
Emp. Form.C16H14F2N4O3S
Mol. Mass.380.369
SMILES[H][C@@]1(CNC(=O)O1)[C@@H](C)Oc1cc(cc2ncsc12)-c1cnn(c1)C(F)F