Reaction Details
TargetTyrosine-protein kinase SYK
LigandBDBM50076185
Substrate/Competitorn/a
Meas. Tech.ChEMBL_1521566 (CHEMBL3627444)
IC50 35±n/a nM
Citation Thoma, GVeenstra, SStrang, RBlanz, JVangrevelinghe, EBerghausen, JLee, CCZerwes, HG Orally bioavailable Syk inhibitors with activity in a rat PK/PD model. Bioorg Med Chem Lett25:4642-7 (2015) 
 
Tyrosine-protein kinase SYK
Name:Tyrosine-protein kinase SYK
Type:Enzyme
Mol. Mass.:72079.99
Organism:Homo sapiens (Human)
Description:P43405
Residue:635
BDBM50076185
NameBDBM50076185
Synonyms:CHEMBL3416026 | US9290481, 1.1
TypeSmall organic molecule
Emp. Form.C18H22N8O
Mol. Mass.366.4203
SMILESN[C@H]1CCCC[C@H]1Nc1nnc(C(N)=O)c(Nc2cccc3cc[nH]c23)n1