Reaction Details
TargetDelta-type opioid receptor
LigandBDBM50123592
Substrate/Competitorn/a
Meas. Tech.ChEMBL_1521809 (CHEMBL3626669)
Ki>1000±n/a nM
Citation Lee, DYDeng, GMa, ZXu, WYang, LLiu, JDai, RLiu-Chen, LY Synthesis and biological evaluation of 2-alkyl-2-methoxymethyl-salvinorin ethers as selectiveż-opioid receptor agonists. Bioorg Med Chem Lett25:4689-92 (2015) 
 
Delta-type opioid receptor
Name:Delta-type opioid receptor
Type:Enzyme Catalytic Domain
Mol. Mass.:40577.25
Organism:MOUSE
Description:P32300
Residue:372
BDBM50123592
NameBDBM50123592
Synonyms:CHEMBL3622708
TypeSmall organic molecule
Emp. Form.C26H36O7
Mol. Mass.460.5598
SMILES[H][C@]12CC[C@@]3(C)[C@@H](C[C@](CCC)(COC)C(=O)[C@]3([H])[C@@]1(C)C[C@H](OC2=O)c1ccoc1)C(=O)OC