Reaction Details
TargetKappa-type opioid receptor
LigandBDBM50000296
Substrate/Competitorn/a
Meas. Tech.ChEMBL_1521810 (CHEMBL3626670)
Ki 2.7±n/a nM
Citation Lee, DYDeng, GMa, ZXu, WYang, LLiu, JDai, RLiu-Chen, LY Synthesis and biological evaluation of 2-alkyl-2-methoxymethyl-salvinorin ethers as selectiveż-opioid receptor agonists. Bioorg Med Chem Lett25:4689-92 (2015) 
 
Kappa-type opioid receptor
Name:Kappa-type opioid receptor
Type:G Protein-Coupled Receptor (GPCR)
Mol. Mass.:42648.76
Organism:Homo sapiens (Human)
Description:P41145
Residue:380
BDBM50000296
NameBDBM50000296
Synonyms:CHEMBL441765 U-50488H | US11492374, ID 1
TypeSmall organic molecule
Emp. Form.C19H26Cl2N2O
Mol. Mass.369.329
SMILESCN([C@@H]1CCCC[C@H]1N1CCCC1)C(=O)Cc1ccc(Cl)c(Cl)c1