Reaction Details
TargetKappa-type opioid receptor
LigandBDBM50123602
Substrate/Competitorn/a
Meas. Tech.ChEMBL_1521810 (CHEMBL3626670)
Ki>1000±n/a nM
Citation Lee, DYDeng, GMa, ZXu, WYang, LLiu, JDai, RLiu-Chen, LY Synthesis and biological evaluation of 2-alkyl-2-methoxymethyl-salvinorin ethers as selectiveż-opioid receptor agonists. Bioorg Med Chem Lett25:4689-92 (2015) 
 
Kappa-type opioid receptor
Name:Kappa-type opioid receptor
Type:G Protein-Coupled Receptor (GPCR)
Mol. Mass.:42648.76
Organism:Homo sapiens (Human)
Description:P41145
Residue:380
BDBM50123602
NameBDBM50123602
Synonyms:CHEMBL3622716
TypeSmall organic molecule
Emp. Form.C28H39IO7
Mol. Mass.614.5095
SMILES[H][C@]12CC[C@@]3(C)[C@@H](C[C@](CCCCCI)(COC)C(=O)[C@]3([H])[C@@]1(C)C[C@H](OC2=O)c1ccoc1)C(=O)OC