Reaction Details
TargetHistone deacetylase 3
LigandBDBM50123628
Substrate/Competitorn/a
Meas. Tech.ChEMBL_1522023 (CHEMBL3627130)
IC50 1680±n/a nM
Citation Yao, YTu, ZLiao, CWang, ZLi, SYao, HLi, ZJiang, S Discovery of Novel Class I Histone Deacetylase Inhibitors with Promising in Vitro and in Vivo Antitumor Activities. J Med Chem58:7672-80 (2015) 
 
Histone deacetylase 3
Name:Histone deacetylase 3
Type:Enzyme
Mol. Mass.:48829.55
Organism:Homo sapiens (Human)
Description:O15379
Residue:428
BDBM50123628
NameBDBM50123628
Synonyms:CHEMBL3622730
TypeSmall organic molecule
Emp. Form.C29H42N4O6S2
Mol. Mass.606.797
SMILESCCCCCCCC(=O)SCC\C=C\[C@@H]1CC(=O)NCc2nc(cs2)C(=O)N\C(=C/C)C(=O)N[C@@H](C(C)C)C(=O)O1