Reaction Details
TargetHistone deacetylase 2
LigandBDBM50123628
Substrate/Competitorn/a
Meas. Tech.ChEMBL_1522022 (CHEMBL3627129)
IC50 2710±n/a nM
Citation Yao, YTu, ZLiao, CWang, ZLi, SYao, HLi, ZJiang, S Discovery of Novel Class I Histone Deacetylase Inhibitors with Promising in Vitro and in Vivo Antitumor Activities. J Med Chem58:7672-80 (2015) 
 
Histone deacetylase 2
Name:Histone deacetylase 2
Type:Chromatin regulator; hydrolase; repressor
Mol. Mass.:55356.54
Organism:Homo sapiens (Human)
Description:Q92769
Residue:488
BDBM50123628
NameBDBM50123628
Synonyms:CHEMBL3622730
TypeSmall organic molecule
Emp. Form.C29H42N4O6S2
Mol. Mass.606.797
SMILESCCCCCCCC(=O)SCC\C=C\[C@@H]1CC(=O)NCc2nc(cs2)C(=O)N\C(=C/C)C(=O)N[C@@H](C(C)C)C(=O)O1