Reaction Details
TargetHistone deacetylase 4
LigandBDBM50354086
Substrate/Competitorn/a
Meas. Tech.ChEMBL_1522025 (CHEMBL3627132)
IC50>10000±n/a nM
Citation Yao, YTu, ZLiao, CWang, ZLi, SYao, HLi, ZJiang, S Discovery of Novel Class I Histone Deacetylase Inhibitors with Promising in Vitro and in Vivo Antitumor Activities. J Med Chem58:7672-80 (2015) 
 
Histone deacetylase 4
Name:Histone deacetylase 4
Type:Enzyme
Mol. Mass.:119049.39
Organism:Homo sapiens (Human)
Description:P56524
Residue:1084
BDBM50354086
NameBDBM50354086
Synonyms:FK-228 ROMIDEPSIN
TypeSmall organic molecule
Emp. Form.C25H39N3O6S2
Mol. Mass.541.724
SMILESC\C=C1/NC(=O)[C@@H](CS)NC(=O)[C@H](CC(=O)C[C@H](OC(=O)[C@@H](NC1=O)C(C)C)\C=C\CCS)C(C)C