Reaction Details
TargetHistone deacetylase 7
LigandBDBM50123619
Substrate/Competitorn/a
Meas. Tech.ChEMBL_1522027 (CHEMBL3627134)
IC50>10000±n/a nM
Citation Yao, YTu, ZLiao, CWang, ZLi, SYao, HLi, ZJiang, S Discovery of Novel Class I Histone Deacetylase Inhibitors with Promising in Vitro and in Vivo Antitumor Activities. J Med Chem58:7672-80 (2015) 
 
Histone deacetylase 7
Name:Histone deacetylase 7
Type:Chromatin regulator; hydrolase; repressor
Mol. Mass.:102942.62
Organism:Homo sapiens (Human)
Description:Q8WUI4
Residue:952
BDBM50123619
NameBDBM50123619
Synonyms:CHEMBL3622728
TypeSmall organic molecule
Emp. Form.C32H48N4O6S2
Mol. Mass.648.877
SMILESCCCCCCCC(=O)SCC\C=C\[C@@H]1CC(=O)N[C@H](C(C)C)c2nc(cs2)C(=O)N\C(=C/C)C(=O)N[C@@H](C(C)C)C(=O)O1