Reaction Details
TargetPeptidyl-prolyl cis-trans isomerase FKBP5
LigandBDBM50125329
Substrate/Competitorn/a
Meas. Tech.ChEMBL_1519315 (CHEMBL3624906)
Ki 600±n/a nM
Citation Feng, XSippel, CBracher, AHausch, F Structure-Affinity Relationship Analysis of Selective FKBP51 Ligands. J Med Chem58:7796-806 (2015) 
 
Peptidyl-prolyl cis-trans isomerase FKBP5
Name:Peptidyl-prolyl cis-trans isomerase FKBP5
Type:PROTEIN
Mol. Mass.:51207.06
Organism:Homo sapiens (Human)
Description:ChEMBL_952910
Residue:457
BDBM50125329
NameBDBM50125329
Synonyms:CHEMBL3623615
TypeSmall organic molecule
Emp. Form.C39H47NO8
Mol. Mass.657.7924
SMILESCOc1ccc(CC[C@@H](OC(=O)[C@@H]2CCCCN2C(=O)[C@@H](C2CCCCC2)c2ccccc2)c2cccc(OCC(O)=O)c2)cc1OC