Reaction Details
TargetPeptidyl-prolyl cis-trans isomerase FKBP4
LigandBDBM50125328
Substrate/Competitorn/a
Meas. Tech.ChEMBL_1519316 (CHEMBL3624907)
Ki>500000±n/a nM
Citation Feng, XSippel, CBracher, AHausch, F Structure-Affinity Relationship Analysis of Selective FKBP51 Ligands. J Med Chem58:7796-806 (2015) 
 
Peptidyl-prolyl cis-trans isomerase FKBP4
Name:Peptidyl-prolyl cis-trans isomerase FKBP4
Type:PROTEIN
Mol. Mass.:51793.87
Organism:Homo sapiens (Human)
Description:ChEMBL_154482
Residue:459
BDBM50125328
NameBDBM50125328
Synonyms:CHEMBL3623616
TypeSmall organic molecule
Emp. Form.C36H47NO8
Mol. Mass.621.7603
SMILESCOc1ccc(CC[C@@H](OC(=O)[C@@H]2CCCCN2C(=O)[C@H](CC=C)C2CCCCC2)c2cccc(OCC(O)=O)c2)cc1OC