Reaction Details
TargetPeptidyl-prolyl cis-trans isomerase FKBP4
LigandBDBM50125331
Substrate/Competitorn/a
Meas. Tech.ChEMBL_1519316 (CHEMBL3624907)
Ki>100000±n/a nM
Citation Feng, XSippel, CBracher, AHausch, F Structure-Affinity Relationship Analysis of Selective FKBP51 Ligands. J Med Chem58:7796-806 (2015) 
 
Peptidyl-prolyl cis-trans isomerase FKBP4
Name:Peptidyl-prolyl cis-trans isomerase FKBP4
Type:PROTEIN
Mol. Mass.:51793.87
Organism:Homo sapiens (Human)
Description:ChEMBL_154482
Residue:459
BDBM50125331
NameBDBM50125331
Synonyms:CHEMBL3623614
TypeSmall organic molecule
Emp. Form.C40H49NO9
Mol. Mass.687.8184
SMILESCOc1cccc(c1)[C@H](C1CCCCC1)C(=O)N1CCCC[C@H]1C(=O)O[C@H](CCc1ccc(OC)c(OC)c1)c1cccc(OCC(O)=O)c1