Reaction Details
TargetCoagulation factor IX
LigandBDBM50125979
Substrate/Competitorn/a
Meas. Tech.ChEMBL_1522950 (CHEMBL3630982)
Ki 1.000000±n/a nM
Citation Zhang, TAndre, PBateman, TJChen, YHDesai, KEllsworth, KGeissler, WMGuo, LHruza, AJian, TMeng, DParker, DLQian, XReichert, PSherer, ECShu, MSmith, CJSonatore, LMTschirret-Guth, RNolting, AFOrr, RCampeau, LCAraki, KNishimura, TSakurada, IWood, HB Development of a novel class of potent and selective FIXa inhibitors. Bioorg Med Chem Lett25:4945-9 (2015) 
 
Coagulation factor IX
Name:Coagulation factor IX
Type:Enzyme
Mol. Mass.:51768.83
Organism:Homo sapiens (Human)
Description:P00740
Residue:461
BDBM50125979
NameBDBM50125979
Synonyms:CHEMBL3627899
TypeSmall organic molecule
Emp. Form.C27H20Cl2F2N6O2
Mol. Mass.569.39
SMILESCc1ncn(n1)-c1cc(Cl)c(C(=O)NC[C@@H](c2cccc(F)c2)c2nc3c(F)ccc(C)c3c(=O)[nH]2)c(Cl)c1