Reaction Details
TargetPotassium voltage-gated channel subfamily H member 2
LigandBDBM50125977
Substrate/Competitorn/a
Meas. Tech.ChEMBL_1522961 (CHEMBL3631137)
IC50 19900±n/a nM
Citation Zhang, TAndre, PBateman, TJChen, YHDesai, KEllsworth, KGeissler, WMGuo, LHruza, AJian, TMeng, DParker, DLQian, XReichert, PSherer, ECShu, MSmith, CJSonatore, LMTschirret-Guth, RNolting, AFOrr, RCampeau, LCAraki, KNishimura, TSakurada, IWood, HB Development of a novel class of potent and selective FIXa inhibitors. Bioorg Med Chem Lett25:4945-9 (2015) 
 
Potassium voltage-gated channel subfamily H member 2
Name:Potassium voltage-gated channel subfamily H member 2
Type:Multi-pass membrane protein
Mol. Mass.:126672.65
Organism:Homo sapiens (Human)
Description:Q12809
Residue:1159
BDBM50125977
NameBDBM50125977
Synonyms:CHEMBL3627897
TypeSmall organic molecule
Emp. Form.C26H21Cl2FN6O
Mol. Mass.523.389
SMILESCc1ncn(n1)-c1cc(Cl)c(C(=O)NC[C@@H](c2cccc(F)c2)c2ccc3[nH]c(C)nc3c2)c(Cl)c1