Reaction Details
TargetCoagulation factor X
LigandBDBM50126928
Substrate/Competitorn/a
Meas. Tech.ChEMBL_1524005 (CHEMBL3630477)
Ki 258±n/a nM
Citation Meng, DAndre, PBateman, TJBerger, RChen, YHDesai, KDewnani, SEllsworth, KFeng, DGeissler, WMGuo, LHruza, AJian, TLi, HMetzger, JParker, DLReichert, PSherer, ECSmith, CJSonatore, LMTschirret-Guth, RWu, JXu, JZhang, TCampeau, LCOrr, RPoirier, MMcCabe-Dunn, JAraki, KNishimura, TSakurada, IHirabayashi, TWood, HB Development of a novel tricyclic class of potent and selective FIXa inhibitors. Bioorg Med Chem Lett25:5437-43 (2015) 
 
Coagulation factor X
Name:Coagulation factor X
Type:Enzyme
Mol. Mass.:54726.60
Organism:Homo sapiens (Human)
Description:n/a
Residue:488
BDBM50126928
NameBDBM50126928
Synonyms:CHEMBL3628837
TypeSmall organic molecule
Emp. Form.C24H24Cl2N6O2
Mol. Mass.499.392
SMILESCC(O)[C@]1(CCc2nn3cc(C)ccc3c2C1)NC(=O)c1c(Cl)cc(cc1Cl)-n1cnc(C)n1