Reaction Details
TargetCoagulation factor IX
LigandBDBM50126923
Substrate/Competitorn/a
Meas. Tech.ChEMBL_1524004 (CHEMBL3630476)
Ki 5.9±n/a nM
Citation Meng, DAndre, PBateman, TJBerger, RChen, YHDesai, KDewnani, SEllsworth, KFeng, DGeissler, WMGuo, LHruza, AJian, TLi, HMetzger, JParker, DLReichert, PSherer, ECSmith, CJSonatore, LMTschirret-Guth, RWu, JXu, JZhang, TCampeau, LCOrr, RPoirier, MMcCabe-Dunn, JAraki, KNishimura, TSakurada, IHirabayashi, TWood, HB Development of a novel tricyclic class of potent and selective FIXa inhibitors. Bioorg Med Chem Lett25:5437-43 (2015) 
 
Coagulation factor IX
Name:Coagulation factor IX
Type:Enzyme
Mol. Mass.:51768.83
Organism:Homo sapiens (Human)
Description:P00740
Residue:461
BDBM50126923
NameBDBM50126923
Synonyms:CHEMBL3628832 | US10351558, Example 67
TypeSmall organic molecule
Emp. Form.C28H25ClN6O
Mol. Mass.496.991
SMILESCc1ncn(n1)-c1ccc(C(=O)N[C@@]2(CCc3nc4cc(C)ccc4n3C2)c2ccccc2)c(Cl)c1