Reaction Details
TargetCoagulation factor IX
LigandBDBM50126948
Substrate/Competitorn/a
Meas. Tech.ChEMBL_1524004 (CHEMBL3630476)
Ki 5.0±n/a nM
Citation Meng, DAndre, PBateman, TJBerger, RChen, YHDesai, KDewnani, SEllsworth, KFeng, DGeissler, WMGuo, LHruza, AJian, TLi, HMetzger, JParker, DLReichert, PSherer, ECSmith, CJSonatore, LMTschirret-Guth, RWu, JXu, JZhang, TCampeau, LCOrr, RPoirier, MMcCabe-Dunn, JAraki, KNishimura, TSakurada, IHirabayashi, TWood, HB Development of a novel tricyclic class of potent and selective FIXa inhibitors. Bioorg Med Chem Lett25:5437-43 (2015) 
 
Coagulation factor IX
Name:Coagulation factor IX
Type:Enzyme
Mol. Mass.:51768.83
Organism:Homo sapiens (Human)
Description:P00740
Residue:461
BDBM50126948
NameBDBM50126948
Synonyms:CHEMBL3628953
TypeSmall organic molecule
Emp. Form.C27H27Cl2N9O
Mol. Mass.564.469
SMILESCC(C)n1cc(nn1)[C@]1(CCc2nn3cc(C)ccc3c2C1)NC(=O)c1c(Cl)cc(cc1Cl)-n1cnc(C)n1