Reaction Details
TargetCoagulation factor IX
LigandBDBM50126954
Substrate/Competitorn/a
Meas. Tech.ChEMBL_1524004 (CHEMBL3630476)
Ki 8.4±n/a nM
Citation Meng, DAndre, PBateman, TJBerger, RChen, YHDesai, KDewnani, SEllsworth, KFeng, DGeissler, WMGuo, LHruza, AJian, TLi, HMetzger, JParker, DLReichert, PSherer, ECSmith, CJSonatore, LMTschirret-Guth, RWu, JXu, JZhang, TCampeau, LCOrr, RPoirier, MMcCabe-Dunn, JAraki, KNishimura, TSakurada, IHirabayashi, TWood, HB Development of a novel tricyclic class of potent and selective FIXa inhibitors. Bioorg Med Chem Lett25:5437-43 (2015) 
 
Coagulation factor IX
Name:Coagulation factor IX
Type:Enzyme
Mol. Mass.:51768.83
Organism:Homo sapiens (Human)
Description:P00740
Residue:461
BDBM50126954
NameBDBM50126954
Synonyms:CHEMBL3628959
TypeSmall organic molecule
Emp. Form.C29H22Cl2F3N5O
Mol. Mass.584.419
SMILESCc1ccc2n3C[C@@](CCc3c(c2c1)C(F)(F)F)(NC(=O)c1c(Cl)cc(cc1Cl)-n1cnnc1)c1ccccc1