Reaction Details
TargetLactoylglutathione lyase
LigandBDBM50092826
Substrate/Competitorn/a
Meas. Tech.ChEMBL_1524150 (CHEMBL3631235)
Ki 14±n/a nM
Citation Sang, YShi, QMo, MNi, CLi, ZLiu, BDeng, QCreighton, DJZheng, ZB Novel bivalent inhibitors with sub-nanomolar affinities towards human glyoxalase I. Bioorg Med Chem Lett25:4724-7 (2015) 
 
Lactoylglutathione lyase
Name:Lactoylglutathione lyase
Type:Enzyme
Mol. Mass.:20772.95
Organism:Homo sapiens (Human)
Description:Q04760
Residue:184
BDBM50092826
NameBDBM50092826
Synonyms:(2S)-2-amino-5-{[(1R)-1-[({[(4-bromophenyl)(hydroxy)amino]carbonyl}thio)methyl]-2-(carboxyamino)-2-oxoethyl]amino}-5-oxopentanoic acid CHEMBL128872 | S-(N-4bromophenyl-N-hydroxycarbamoyl)glutathione
TypeSmall organic molecule
Emp. Form.C17H21BrN4O8S
Mol. Mass.521.34
SMILESN[C@@H](CCC(=O)N[C@@H](CSC(=O)N(O)c1ccc(Br)cc1)C(=O)NCC(O)=O)C(O)=O