Reaction Details
TargetReceptor-interacting serine/threonine-protein kinase 2
LigandBDBM50128684
Substrate/Competitorn/a
Meas. Tech.ChEMBL_1522561 (CHEMBL3631914)
IC50 7.9±n/a nM
Citation Charnley, AKConvery, MALakdawala Shah, AJones, EHardwicke, PBridges, AOuellette, MTotoritis, RSchwartz, BKing, BWWisnoski, DDKang, JEidam, PMVotta, BJGough, PJMarquis, RWBertin, JCasillas, L Crystal structures of human RIP2 kinase catalytic domain complexed with ATP-competitive inhibitors: Foundations for understanding inhibitor selectivity. Bioorg Med Chem23:7000-6 (2015) 
 
Receptor-interacting serine/threonine-protein kinase 2
Name:Receptor-interacting serine/threonine-protein kinase 2
Type:Protein
Mol. Mass.:61201.30
Organism:Homo sapiens (Human)
Description:n/a
Residue:540
BDBM50128684
NameBDBM50128684
Synonyms:CHEMBL3628627
TypeSmall organic molecule
Emp. Form.C30H26F2N6O5S3
Mol. Mass.684.756
SMILESCS(=O)(=O)c1cccc(Nc2nccc(n2)-c2sc(nc2-c2cccc(NS(=O)(=O)c3c(F)cccc3F)c2)N2CCOCC2)c1