Reaction Details
TargetReceptor-interacting serine/threonine-protein kinase 2
LigandBDBM50139604
Substrate/Competitorn/a
Meas. Tech.ChEMBL_1522562 (CHEMBL3631915)
IC50 63±n/a nM
Citation Charnley, AKConvery, MALakdawala Shah, AJones, EHardwicke, PBridges, AOuellette, MTotoritis, RSchwartz, BKing, BWWisnoski, DDKang, JEidam, PMVotta, BJGough, PJMarquis, RWBertin, JCasillas, L Crystal structures of human RIP2 kinase catalytic domain complexed with ATP-competitive inhibitors: Foundations for understanding inhibitor selectivity. Bioorg Med Chem23:7000-6 (2015) 
 
Receptor-interacting serine/threonine-protein kinase 2
Name:Receptor-interacting serine/threonine-protein kinase 2
Type:Protein
Mol. Mass.:61201.30
Organism:Homo sapiens (Human)
Description:n/a
Residue:540
BDBM50139604
NameBDBM50139604
Synonyms:1-(5-tert-Butyl-isoxazol-3-yl)-3-[4-(pyridin-4-yloxy)-phenyl]-urea CHEMBL166031
TypeSmall organic molecule
Emp. Form.C19H20N4O3
Mol. Mass.352.3871
SMILESCC(C)(C)c1cc(NC(=O)Nc2ccc(Oc3ccncc3)cc2)no1