Reaction Details
TargetTransient receptor potential cation channel subfamily V member 1
LigandBDBM50128923
Substrate/Competitorn/a
Meas. Tech.ChEMBL_1522886 (CHEMBL3630759)
Ki 0.700000±n/a nM
Citation Ann, JJung, AKim, MYKim, HMRyu, HKim, SKang, DWHong, SCui, MChoi, SBlumberg, PMFrank-Foltyn, RBahrenberg, GStockhausen, HChristoph, TLee, J Structure activity relationships of benzyl C-region analogs of 2-(3-fluoro-4-methylsulfonamidophenyl)propanamides as potent TRPV1 antagonists. Bioorg Med Chem23:6844-54 (2015) 
 
Transient receptor potential cation channel subfamily V member 1
Name:Transient receptor potential cation channel subfamily V member 1
Type:Protein
Mol. Mass.:94960.75
Organism:Homo sapiens (Human)
Description:Q8NER1
Residue:839
BDBM50128923
NameBDBM50128923
Synonyms:CHEMBL3629501
TypeSmall organic molecule
Emp. Form.C29H32F4N4O3S
Mol. Mass.592.648
SMILESCC(C(=O)NCc1ccc(cc1N1CCN(CC1)c1ccc(C)cc1)C(F)(F)F)c1ccc(NS(C)(=O)=O)c(F)c1