Reaction Details
TargetCarbonic anhydrase 1
LigandBDBM10860
Substrate/Competitorn/a
Meas. Tech.ChEMBL_1524262 (CHEMBL3631738)
Ki 41910±n/a nM
Citation Fidan, ISalmas, REArslan, MSentürk, MDurdagi, SEkinci, DSentürk, ECosgun, SSupuran, CT Carbonic anhydrase inhibitors: Design, synthesis, kinetic, docking and molecular dynamics analysis of novel glycine and phenylalanine sulfonamide derivatives. Bioorg Med Chem23:7353-8 (2015) 
 
Carbonic anhydrase 1
Name:Carbonic anhydrase 1
Type:Enzyme
Mol. Mass.:28873.37
Organism:Homo sapiens (Human)
Description:P00915
Residue:261
BDBM10860
NameBDBM10860
Synonyms:4-(aminomethyl)benzene-1-sulfonamide MAFENIDE aromatic/heteroaromatic sulfonamide 5 | hCA inhibitor, 9
TypeSmall organic molecule
Emp. Form.C7H10N2O2S
Mol. Mass.186.232
SMILESNCc1ccc(cc1)S(N)(=O)=O