Reaction Details
TargetMAP kinase-interacting serine/threonine-protein kinase 2
LigandBDBM50130706
Substrate/Competitorn/a
Meas. Tech.ChEMBL_1527068 (CHEMBL3637759)
Ki 31±n/a nM
Citation Teo, TYang, YYu, MBasnet, SKGillam, THou, JSchmid, RMKumarasiri, MDiab, SAlbrecht, HSykes, MJWang, S An integrated approach for discovery of highly potent and selective Mnk inhibitors: Screening, synthesis and SAR analysis. Eur J Med Chem103:539-50 (2015) 
 
MAP kinase-interacting serine/threonine-protein kinase 2
Name:MAP kinase-interacting serine/threonine-protein kinase 2
Type:Protein
Mol. Mass.:51870.79
Organism:Homo sapiens (Human)
Description:Q9HBH9
Residue:465
BDBM50130706
NameBDBM50130706
Synonyms:CHEMBL3632746
TypeSmall organic molecule
Emp. Form.C20H23FN4O3S
Mol. Mass.418.485
SMILESCOCCNC(=O)c1sc2ncnc(Nc3ccc(F)cc3OC(C)C)c2c1C