Reaction Details
TargetMAP kinase-interacting serine/threonine-protein kinase 1
LigandBDBM50130703
Substrate/Competitorn/a
Meas. Tech.ChEMBL_1527074 (CHEMBL3637765)
Ki 1020±n/a nM
Citation Teo, TYang, YYu, MBasnet, SKGillam, THou, JSchmid, RMKumarasiri, MDiab, SAlbrecht, HSykes, MJWang, S An integrated approach for discovery of highly potent and selective Mnk inhibitors: Screening, synthesis and SAR analysis. Eur J Med Chem103:539-50 (2015) 
 
MAP kinase-interacting serine/threonine-protein kinase 1
Name:MAP kinase-interacting serine/threonine-protein kinase 1
Type:Serine/threonine-protein kinase
Mol. Mass.:51342.85
Organism:Homo sapiens (Human)
Description:Q9BUB5
Residue:465
BDBM50130703
NameBDBM50130703
Synonyms:CHEMBL3632743
TypeSmall organic molecule
Emp. Form.C17H17FN4O2S
Mol. Mass.360.406
SMILESCC(C)Oc1cc(F)ccc1Nc1ncnc2sc(C(N)=O)c(C)c12