Reaction Details
TargetSerine protease hepsin
LigandBDBM50130871
Substrate/Competitorn/a
Meas. Tech.ChEMBL_1525565 (CHEMBL3637191)
Ki 400±n/a nM
Citation Goswami, RWohlfahrt, GTörmäkangas, OMoilanen, ALakshminarasimhan, ANagaraj, JArumugam, KNMukherjee, SChacko, ARKrishnamurthy, NRJaleel, MPalakurthy, RKSamiulla, DSRamachandra, M Structure-guided discovery of 2-aryl/pyridin-2-yl-1H-indole derivatives as potent and selective hepsin inhibitors. Bioorg Med Chem Lett25:5309-14 (2015) 
 
Serine protease hepsin
Name:Serine protease hepsin
Type:Enzyme
Mol. Mass.:45016.98
Organism:Homo sapiens (Human)
Description:Human deglycosylated hepsin was expressed in Pichia pastoris.
Residue:417
BDBM50130871
NameBDBM50130871
Synonyms:CHEMBL3632760
TypeSmall organic molecule
Emp. Form.C20H21FN4
Mol. Mass.336.4059
SMILESNC(=N)c1ccc2[nH]c(cc2c1)-c1cccc(n1)C1(F)CCCCC1