Reaction Details
TargetUrokinase-type plasminogen activator
LigandBDBM50130874
Substrate/Competitorn/a
Meas. Tech.ChEMBL_1525567 (CHEMBL3637193)
Ki 7800±n/a nM
Citation Goswami, RWohlfahrt, GTörmäkangas, OMoilanen, ALakshminarasimhan, ANagaraj, JArumugam, KNMukherjee, SChacko, ARKrishnamurthy, NRJaleel, MPalakurthy, RKSamiulla, DSRamachandra, M Structure-guided discovery of 2-aryl/pyridin-2-yl-1H-indole derivatives as potent and selective hepsin inhibitors. Bioorg Med Chem Lett25:5309-14 (2015) 
 
Urokinase-type plasminogen activator
Name:Urokinase-type plasminogen activator
Type:Enzyme
Mol. Mass.:48528.62
Organism:Homo sapiens (Human)
Description:P00749
Residue:431
BDBM50130874
NameBDBM50130874
Synonyms:CHEMBL3632761
TypeSmall organic molecule
Emp. Form.C20H22N4O2
Mol. Mass.350.4143
SMILESNC(=N)c1ccc2[nH]c(cc2c1)-c1cccc([n+]1[O-])C1(O)CCCCC1