Reaction Details
TargetTrypsin
LigandBDBM50130874
Substrate/Competitorn/a
Meas. Tech.ChEMBL_1525574 (CHEMBL3637200)
Ki 800±n/a nM
Citation Goswami, RWohlfahrt, GTörmäkangas, OMoilanen, ALakshminarasimhan, ANagaraj, JArumugam, KNMukherjee, SChacko, ARKrishnamurthy, NRJaleel, MPalakurthy, RKSamiulla, DSRamachandra, M Structure-guided discovery of 2-aryl/pyridin-2-yl-1H-indole derivatives as potent and selective hepsin inhibitors. Bioorg Med Chem Lett25:5309-14 (2015) 
 
Trypsin
Name:Trypsin
Synonyms:Serine protease 1/Trypsin-2/Trypsin-3
Type:n/a
Mol. Mass.:n/a
Description:ASSAY_ID of ChEMBL is 2155713
Components:This complex has 3 components.
Component 1
Name:Serine protease 1
Type:Enzyme
Mol. Mass.:26557.80
Organism:Homo sapiens (Human)
Description:P07477
Residue:247
Component 2
Name:Trypsin-2
Synonyms:Anionic trypsinogen Serine protease 2 TRY2_HUMAN Thrombin & trypsin Trypsin II | Trypsin-2
Type:PROTEIN
Mol. Mass.:26479.43
Organism:Homo sapiens (Human)
Description:ChEMBL_41517
Residue:247
Component 3
Name:Trypsin-3
Synonyms:Brain trypsinogen PRSS3 Serine protease 3 TRY3 TRY4 Trypsin Trypsin IV | Trypsin-3
Type:PROTEIN
Mol. Mass.:32532.52
Organism:Homo sapiens (Human)
Description:ChEMBL_216043
Residue:304
BDBM50130874
NameBDBM50130874
Synonyms:CHEMBL3632761
TypeSmall organic molecule
Emp. Form.C20H22N4O2
Mol. Mass.350.4143
SMILESNC(=N)c1ccc2[nH]c(cc2c1)-c1cccc([n+]1[O-])C1(O)CCCCC1