Reaction Details
TargetP2Y purinoceptor 11
LigandBDBM50118230
Substrate/Competitorn/a
Meas. Tech.ChEBML_1526465
EC50 32700±n/a nM
Citation Azran, SDanino, OFörster, DKenigsberg, SReiser, GDixit, MSingh, VMajor, DTFischer, B Identification of Highly Promising Antioxidants/Neuroprotectants Based on Nucleoside 5'-Phosphorothioate Scaffold. Synthesis, Activity, and Mechanisms of Action. J Med Chem58:8427-43 (2015) 
 
P2Y purinoceptor 11
Name:P2Y purinoceptor 11
Type:PROTEIN
Mol. Mass.:40366.02
Organism:Homo sapiens (Human)
Description:ChEMBL_1362532
Residue:374
BDBM50118230
NameBDBM50118230
Synonyms:5'-O-[(R)-HYDROXY(THIOPHOSPHONOOXY)PHOSPHORYL]ADENOSINE CHEMBL335206 | adenosine-5'-O-beta-thiodiphosphate
TypeSmall organic molecule
Emp. Form.C10H15N5O9P2S
Mol. Mass.443.267
SMILESNc1ncnc2n(cnc12)[C@@H]1O[C@H](COP(O)(=O)OP(O)(S)=O)[C@@H](O)[C@H]1O