Reaction Details
TargetP2Y purinoceptor 11
LigandBDBM50131064
Substrate/Competitorn/a
Meas. Tech.ChEBML_1526465
EC50 1000±n/a nM
Citation Azran, SDanino, OFörster, DKenigsberg, SReiser, GDixit, MSingh, VMajor, DTFischer, B Identification of Highly Promising Antioxidants/Neuroprotectants Based on Nucleoside 5'-Phosphorothioate Scaffold. Synthesis, Activity, and Mechanisms of Action. J Med Chem58:8427-43 (2015) 
 
P2Y purinoceptor 11
Name:P2Y purinoceptor 11
Type:PROTEIN
Mol. Mass.:40366.02
Organism:Homo sapiens (Human)
Description:ChEMBL_1362532
Residue:374
BDBM50131064
NameBDBM50131064
Synonyms:CHEMBL3634182
TypeSmall organic molecule
Emp. Form.C11H17N5O9P2S2
Mol. Mass.489.358
SMILESCSc1nc(N)c2ncn([C@@H]3O[C@H](COP(S)(=O)OP(O)(O)=O)[C@@H](O)[C@H]3O)c2n1