Reaction Details
TargetSerine/threonine-protein kinase pim-3
LigandBDBM50131263
Substrate/Competitorn/a
Meas. Tech.ChEBML_1526830
Ki 0.160000±n/a nM
Citation Hu, HWang, XChan, GKChang, JHDo, SDrummond, JEbens, ALee, WLy, JLyssikatos, JPMurray, JMoffat, JGChao, QTsui, VWallweber, HKolesnikov, A Discovery of 3,5-substituted 6-azaindazoles as potent pan-Pim inhibitors. Bioorg Med Chem Lett25:5258-64 (2015) 
 
Serine/threonine-protein kinase pim-3
Name:Serine/threonine-protein kinase pim-3
Type:Protein
Mol. Mass.:35888.19
Organism:Homo sapiens (Human)
Description:Q86V86
Residue:326
BDBM50131263
NameBDBM50131263
Synonyms:CHEMBL3634755 | US9260425, 264
TypeSmall organic molecule
Emp. Form.C20H21N7O
Mol. Mass.375.427
SMILESCn1cc(cn1)-c1cc2c(n[nH]c2cn1)-c1cccc(O[C@@H]2CCCNC2)n1