Reaction Details
TargetKinesin-like protein KIF11
LigandBDBM23823
Substrate/Competitorn/a
Meas. Tech.ChEMBL_1526764 (CHEMBL3636399)
IC50 166±n/a nM
Citation Ogo, NIshikawa, YSawada, JMatsuno, KHashimoto, AAsai, A Structure-Guided Design of Novel l-Cysteine Derivatives as Potent KSP Inhibitors. ACS Med Chem Lett6:1004-9 (2015) 
 
Kinesin-like protein KIF11
Name:Kinesin-like protein KIF11
Type:PROTEIN
Mol. Mass.:119138.97
Organism:Homo sapiens (Human)
Description:ChEMBL_1457426
Residue:1056
BDBM23823
NameBDBM23823
Synonyms:(2R)-2-amino-3-{[(4-methoxyphenyl)diphenylmethyl]sulfanyl}propanoic acid S-Trityl-L-Cysteine (STLC) Analogue, 52
TypeSmall organic molecule
Emp. Form.C23H23NO3S
Mol. Mass.393.499
SMILESCOc1ccc(cc1)C(SC[C@H](N)C(O)=O)(c1ccccc1)c1ccccc1