Reaction Details
TargetPlatelet-activating factor acetylhydrolase
LigandBDBM50132815
Substrate/Competitorn/a
Meas. Tech.ChEMBL_1525084 (CHEMBL3635122)
IC50 17±n/a nM
Citation Chen, XXu, WWang, KMo, MZhang, WDu, LYuan, XXu, YWang, YShen, J Discovery of a Novel Series of Imidazo[1,2-a]pyrimidine Derivatives as Potent and Orally Bioavailable Lipoprotein-Associated Phospholipase A2 Inhibitors. J Med Chem58:8529-41 (2015) 
 
Platelet-activating factor acetylhydrolase
Name:Platelet-activating factor acetylhydrolase
Type:PROTEIN
Mol. Mass.:50084.41
Organism:Homo sapiens (Human)
Description:ChEMBL_156212
Residue:441
BDBM50132815
NameBDBM50132815
Synonyms:CHEMBL3634546
TypeSmall organic molecule
Emp. Form.C24H17ClF3N5O2
Mol. Mass.499.872
SMILESCn1cc(cn1)-c1cnc2nc(OCc3ccc(Oc4ccc(Cl)c(c4)C(F)(F)F)cc3)ccn12