Reaction Details
TargetCarbonic anhydrase 2
LigandBDBM50133390
Substrate/Competitorn/a
Meas. Tech.ChEMBL_1525819 (CHEMBL3635733)
Ki 42±n/a nM
Citation La Regina, GColuccia, AFamiglini, VPelliccia, SMonti, LVullo, DNuti, EAlterio, VDe Simone, GMonti, SMPan, PParkkila, SSupuran, CTRossello, ASilvestri, R Discovery of 1,1'-Biphenyl-4-sulfonamides as a New Class of Potent and Selective Carbonic Anhydrase XIV Inhibitors. J Med Chem58:8564-72 (2015) 
 
Carbonic anhydrase 2
Name:Carbonic anhydrase 2
Type:Enzyme
Mol. Mass.:29250.71
Organism:Homo sapiens (Human)
Description:P00918
Residue:260
BDBM50133390
NameBDBM50133390
Synonyms:CHEMBL3632826
TypeSmall organic molecule
Emp. Form.C17H19NO4S
Mol. Mass.333.402
SMILESCC(C)(C)OC(=O)c1ccc(cc1)-c1ccc(cc1)S(N)(=O)=O