Reaction Details
TargetCarbonic anhydrase 2
LigandBDBM50133395
Substrate/Competitorn/a
Meas. Tech.ChEMBL_1525819 (CHEMBL3635733)
Ki 9.1±n/a nM
Citation La Regina, GColuccia, AFamiglini, VPelliccia, SMonti, LVullo, DNuti, EAlterio, VDe Simone, GMonti, SMPan, PParkkila, SSupuran, CTRossello, ASilvestri, R Discovery of 1,1'-Biphenyl-4-sulfonamides as a New Class of Potent and Selective Carbonic Anhydrase XIV Inhibitors. J Med Chem58:8564-72 (2015) 
 
Carbonic anhydrase 2
Name:Carbonic anhydrase 2
Type:Enzyme
Mol. Mass.:29250.71
Organism:Homo sapiens (Human)
Description:P00918
Residue:260
BDBM50133395
NameBDBM50133395
Synonyms:CHEMBL3632831
TypeSmall organic molecule
Emp. Form.C12H12N2O2S
Mol. Mass.248.301
SMILESNc1ccc(cc1)-c1ccc(cc1)S(N)(=O)=O