Reaction Details
TargetCarbonic anhydrase 2
LigandBDBM50133409
Substrate/Competitorn/a
Meas. Tech.ChEMBL_1525819 (CHEMBL3635733)
Ki 5.2±n/a nM
Citation La Regina, GColuccia, AFamiglini, VPelliccia, SMonti, LVullo, DNuti, EAlterio, VDe Simone, GMonti, SMPan, PParkkila, SSupuran, CTRossello, ASilvestri, R Discovery of 1,1'-Biphenyl-4-sulfonamides as a New Class of Potent and Selective Carbonic Anhydrase XIV Inhibitors. J Med Chem58:8564-72 (2015) 
 
Carbonic anhydrase 2
Name:Carbonic anhydrase 2
Type:Enzyme
Mol. Mass.:29250.71
Organism:Homo sapiens (Human)
Description:P00918
Residue:260
BDBM50133409
NameBDBM50133409
Synonyms:CHEMBL3632845
TypeSmall organic molecule
Emp. Form.C19H18N2O2S
Mol. Mass.338.423
SMILESNc1ccc(Cc2ccc(cc2)-c2ccc(cc2)S(N)(=O)=O)cc1