Reaction Details
TargetCarbonic anhydrase 14
LigandBDBM50133393
Substrate/Competitorn/a
Meas. Tech.ChEMBL_1525822 (CHEMBL3635736)
Ki 0.690000±n/a nM
Citation La Regina, GColuccia, AFamiglini, VPelliccia, SMonti, LVullo, DNuti, EAlterio, VDe Simone, GMonti, SMPan, PParkkila, SSupuran, CTRossello, ASilvestri, R Discovery of 1,1'-Biphenyl-4-sulfonamides as a New Class of Potent and Selective Carbonic Anhydrase XIV Inhibitors. J Med Chem58:8564-72 (2015) 
 
Carbonic anhydrase 14
Name:Carbonic anhydrase 14
Type:Enzyme
Mol. Mass.:37665.67
Organism:Homo sapiens (Human)
Description:Human (cloned) isozyme.
Residue:337
BDBM50133393
NameBDBM50133393
Synonyms:CHEMBL3632829
TypeSmall organic molecule
Emp. Form.C15H16N2O4S
Mol. Mass.320.364
SMILESNS(=O)(=O)c1ccc(cc1)-c1ccc(cc1)C(=O)NCCO