Reaction Details
TargetGastrin/cholecystokinin type B receptor
LigandBDBM50329179
Substrate/Competitorn/a
Meas. Tech.ChEMBL_1543647 (CHEMBL3751031)
Ki 25±n/a nM
Citation Desai, AJLam, PCOrry, AAbagyan, RChristopoulos, ASexton, PMMiller, LJ Molecular Mechanism of Action of Triazolobenzodiazepinone Agonists of the Type 1 Cholecystokinin Receptor. Possible Cooperativity across the Receptor Homodimeric Complex. J Med Chem58:9562-77 (2015) 
 
Gastrin/cholecystokinin type B receptor
Name:Gastrin/cholecystokinin type B receptor
Type:G Protein-Coupled Receptor (GPCR)
Mol. Mass.:48445.79
Organism:Homo sapiens (Human)
Description:Stable expression of human CCK-2 receptors in HEK 293 cells.
Residue:447
BDBM50329179
NameBDBM50329179
Synonyms:2-((4S)-4-((1H-indol-3-yl)methyl)-5-oxo-1-phenyl-4H-benzo[b][1,2,4]triazolo[4,3-d][1,4]diazepin-6(5H)-yl)-N-benzyl-N-isopropylacetamide | CHEMBL1269258
TypeSmall organic molecule
Emp. Form.C37H34N6O2
Mol. Mass.594.7049
SMILESCC(C)N(Cc1ccccc1)C(=O)CN1c2ccccc2-n2c(nnc2-c2ccccc2)[C@H](Cc2c[nH]c3ccccc23)C1=O