Reaction Details
TargetGastrin/cholecystokinin type B receptor
LigandBDBM50380728
Substrate/Competitorn/a
Meas. Tech.ChEMBL_1543654 (CHEMBL3751038)
EC50<1000±n/a nM
Citation Desai, AJLam, PCOrry, AAbagyan, RChristopoulos, ASexton, PMMiller, LJ Molecular Mechanism of Action of Triazolobenzodiazepinone Agonists of the Type 1 Cholecystokinin Receptor. Possible Cooperativity across the Receptor Homodimeric Complex. J Med Chem58:9562-77 (2015) 
 
Gastrin/cholecystokinin type B receptor
Name:Gastrin/cholecystokinin type B receptor
Type:G Protein-Coupled Receptor (GPCR)
Mol. Mass.:48445.79
Organism:Homo sapiens (Human)
Description:Stable expression of human CCK-2 receptors in HEK 293 cells.
Residue:447
BDBM50380728
NameBDBM50380728
Synonyms:CHEMBL2017835
TypeSmall organic molecule
Emp. Form.C40H39N7O2
Mol. Mass.649.7834
SMILESCc1cc(C)cc(C[C@H]2CCCCN2C(=O)CN2c3ccccc3-n3c(nnc3-c3ccccc3)[C@H](Cc3n[nH]c4ccccc34)C2=O)c1