Reaction Details
TargetDual specificity mitogen-activated protein kinase kinase 3
LigandBDBM50134589
Substrate/Competitorn/a
Meas. Tech.ChEMBL_1544298 (CHEMBL3751415)
IC50 4.0±n/a nM
Citation Adams, MKobayashi, TLawson, JDSaitoh, MShimokawa, KBigi, SVHixon, MSSmith, CRTatamiya, TGoto, MRusso, JGrimshaw, CESwann, S Fragment-based drug discovery of potent and selective MKK3/6 inhibitors. Bioorg Med Chem Lett26:1086-9 (2016) 
 
Dual specificity mitogen-activated protein kinase kinase 3
Name:Dual specificity mitogen-activated protein kinase kinase 3
Type:Protein
Mol. Mass.:39321.50
Organism:Homo sapiens (Human)
Description:n/a
Residue:347
BDBM50134589
NameBDBM50134589
Synonyms:CHEMBL3747095
TypeSmall organic molecule
Emp. Form.C12H12N4O
Mol. Mass.228.2499
SMILESCNc1ccc(nc1C(N)=O)-c1ccncc1