Reaction Details
TargetPolyphenol oxidase 2
LigandBDBM50134709
Substrate/Competitorn/a
Meas. Tech.ChEMBL_1543864 (CHEMBL3749754)
Ki 19±n/a nM
Citation Tan, XSong, YHPark, CLee, KWKim, JYKim, DWKim, KDLee, KWCurtis-Long, MJPark, KH Highly potent tyrosinase inhibitor, neorauflavane from Campylotropis hirtella and inhibitory mechanism with molecular docking. Bioorg Med Chem24:153-9 (2016) 
 
Polyphenol oxidase 2
Name:Polyphenol oxidase 2
Type:Protein
Mol. Mass.:63923.66
Organism:Agaricus bisporus (Common mushroom)
Description:O42713
Residue:556
BDBM50134709
NameBDBM50134709
Synonyms:CHEMBL3747057
TypeSmall organic molecule
Emp. Form.C21H22O5
Mol. Mass.354.3964
SMILESCOc1c2C[C@@H](COc2cc2OC(C)(C)C=Cc12)c1ccc(O)cc1O